BDBM22573 2-{1-[(4-chlorophenyl)carbonyl]-5-methoxy-2-methyl-1H-indol-3-yl}-N-[(2S)-1-hydroxybutan-2-yl]acetamide::CHEMBL27784::alpha-substituted indomethacin ethanolamide, 9
SMILES CC[C@@H](CO)NC(=O)Cc1c(C)n(C(=O)c2ccc(Cl)cc2)c2ccc(OC)cc12
InChI Key InChIKey=GKJWXEORYGBJFS-KRWDZBQOSA-N
Data  4 IC50
PDB links: 1 PDB ID matches this monomer.
  Tab Delimited (TSV)   2D SDfile   Computed 3D by Vconf -m prep SDfile
Find this compound or compounds like it in BindingDB:
Activity Spreadsheet -- Enzyme Inhibition Constant Data from BindingDB
Found 4 hits for monomerid = 22573
TargetProstaglandin G/H synthase 1(Ovis aries (Sheep))
Michigan State University
LigandPNGBDBM22573(2-{1-[(4-chlorophenyl)carbonyl]-5-methoxy-2-methyl...)
Affinity DataIC50:  350nMpH: 8.0 T: 2°C. Assay description: For the time-dependent inhibition studies, COX enzyme was incubated with test co mpounds for 20 min and then analyzed for remaining COX activity by t...
TargetProstaglandin G/H synthase 2(Homo sapiens (Human))
Vanderbilt University School Of Medicine
Curated by ChEMBL
LigandPNGBDBM22573(2-{1-[(4-chlorophenyl)carbonyl]-5-methoxy-2-methyl...)
Affinity DataIC50:  280nM. Assay description: Inhibitory concentration against human prostaglandin G/H synthase 2
In DepthDetails ArticlePubMed
TargetProstaglandin G/H synthase 1(Ovis aries (Sheep))
Michigan State University
LigandPNGBDBM22573(2-{1-[(4-chlorophenyl)carbonyl]-5-methoxy-2-methyl...)
Affinity DataIC50:  350nM. Assay description: Inhibitory concentration against prostaglandin G/H synthase 1
TargetProstaglandin G/H synthase 2(Homo sapiens (Human))
Vanderbilt University School Of Medicine
Curated by ChEMBL
LigandPNGBDBM22573(2-{1-[(4-chlorophenyl)carbonyl]-5-methoxy-2-methyl...)
Affinity DataIC50:  280nMpH: 8.0 T: 2°C. Assay description: For the time-dependent inhibition studies, COX enzyme was incubated with test co mpounds for 20 min and then analyzed for remaining COX activity by t...
In DepthDetails ArticlePubMed