BDBM227245 US9328106, 196
SMILES Cn1ncc(NC(=O)c2ccc(F)c(n2)-c2c(F)cc(cc2F)C2(O)CCOCC2)c1[C@@H]1CC[C@@H](N)[C@H](F)CO1
InChI Key InChIKey=GFYSDXOJIAVGLX-KNKQGSTJSA-N
Data  1 KI
  Tab Delimited (TSV)   2D SDfile   Computed 3D by Vconf -m prep SDfile
Find this compound or compounds like it in BindingDB:
Activity Spreadsheet -- Enzyme Inhibition Constant Data from BindingDB
Found 1 hit for monomerid = 227245
TargetSerine/threonine-protein kinase pim-1(Homo sapiens (Human))
Genentech
US Patent
LigandPNGBDBM227245(US9328106, 196)
Affinity DataKi:  0.00600nM ΔG°:  -15.3kcal/molepH: 7.2 T: 2°C. Assay description: LC3K assay: PIM-1, -2, and -3 enzymes were generated as fusion proteins expressed in bacteria and purified by IMAC column chromatography (Sun, X., Ch...
Ligand InfoPC cidPC sid
In DepthDetails US Patent