BDBM23010 (5Z,8Z,11Z,14Z)-icosa-5,8,11,14-tetraen-1-yl N-[2-(5-hydroxy-1H-indol-3-yl)ethyl]carbamate::N-arachidonoylserotonin carbamate analogue, 3a
SMILES CCCCC\C=C/C\C=C/C\C=C/C\C=C/CCCCOC(=O)NCCc1c[nH]c2ccc(O)cc12
InChI Key InChIKey=IMSLJIUGZXXBQE-DOFZRALJSA-N
Data  2 IC50
  Tab Delimited (TSV)   2D SDfile   Computed 3D by Vconf -m prep SDfile
Find this compound or compounds like it in BindingDB:
Activity Spreadsheet -- Enzyme Inhibition Constant Data from BindingDB
Found 2 hits for monomerid = 23010
TargetTransient receptor potential cation channel subfamily V member 1(Homo sapiens (Human))
Sapienza University Of Rome
LigandPNGBDBM23010((5Z,8Z,11Z,14Z)-icosa-5,8,11,14-tetraen-1-yl N-[2-...)
Affinity DataIC50:  2.82E+3nM. Assay description: The antagonistic effects of test compounds were evaluated using HEK293 cells stably overexpressing human TRPV1. Experiments were carried out by measu...
In DepthDetails ArticlePubMed
TargetFatty-acid amide hydrolase 1 [30-579](Rattus norvegicus (rat))
Sapienza University Of Rome
LigandPNGBDBM23010((5Z,8Z,11Z,14Z)-icosa-5,8,11,14-tetraen-1-yl N-[2-...)
Affinity DataIC50: >5.00E+4nMpH: 9.0 T: 2°C. Assay description: The effect of the test compounds on the enzymatic hydrolysis of [14C]anandamide was evaluated by using membranes prepared from rat brain. [14C]Ethano...
In DepthDetails ArticlePubMed