BDBM232999 rac-(±)-exo-2-norbornyl carbamate
SMILES CCNC(=O)OC1CC2CCC1C2
InChI Key InChIKey=QQQPFGMENGRTEU-UHFFFAOYSA-N
Data  1 KI
  Tab Delimited (TSV)   2D SDfile   Computed 3D by Vconf -m prep SDfile
Find this compound or compounds like it in BindingDB:
Activity Spreadsheet -- Enzyme Inhibition Constant Data from BindingDB
Found 1 hit for monomerid = 232999
TargetCarboxylic ester hydrolase(Equus caballus (Horse))
Chung Shan Medical University Hospital
LigandPNGBDBM232999(rac-(±)-exo-2-norbornyl carbamate)
Affinity DataKi:  30nM ΔG°:  -10.3kcal/molepH: 7.0 T: 2°C. Assay description: BChE inhibitions by the carbamate inhibitors were assayed by the Ellman method [Ellman et al., Biochem. Pharm., 7:88-95]. BChE-catalyzed hydrolysis o...
Ligand InfoPC cidPC sid
In DepthDetails ArticlePubMed