BDBM236231 US9365575, 9
SMILES Brc1cccc(NC(=O)Nc2ccc(cc2)C2CN=C3N(C2)C(=O)Nc2ccccc32)c1
InChI Key InChIKey=ZPMSJOCWPLMUHX-UHFFFAOYSA-N
Data  1 IC50
  Tab Delimited (TSV)   2D SDfile   Computed 3D by Vconf -m prep SDfile
Find this compound or compounds like it in BindingDB:
Activity Spreadsheet -- Enzyme Inhibition Constant Data from BindingDB
Found 1 hit for monomerid = 236231
TargetVascular endothelial growth factor receptor 2(Homo sapiens (Human))
Allergan
US Patent
LigandPNGBDBM236231(US9365575, 9)
Affinity DataIC50:  250nMpH: 7.4 T: 2°C. Assay description: Biochemical KDR kinase assays were performed in 96 well microtiter plates that were coated overnight with 75 μg/well of poly-Glu-Tyr (4:1) in 10 m...
Ligand InfoPC cidPC sid
In DepthDetails US Patent