BDBM237206 Esculin palmitate
SMILES CCCCCCCCCCCCCCCC(=O)OCC1OC(Oc2cc3ccc(=O)oc3cc2O)C(O)C(O)C1O
InChI Key InChIKey=IRKUOVGUTNOYMP-UHFFFAOYSA-N
Data  4 IC50
  Tab Delimited (TSV)   2D SDfile   Computed 3D by Vconf -m prep SDfile
Find this compound or compounds like it in BindingDB:
Activity Spreadsheet -- Enzyme Inhibition Constant Data from BindingDB
Found 1 hit for monomerid = 237206
TargetProthrombin(Bos taurus (Bovine))
Slovak University Of Technology
LigandPNGBDBM237206(Esculin palmitate)
Affinity DataIC50:  5.40E+4nMpH: 8.0Assay Description:The rate of hydrolysis of the substrates (0.3 mM) by trypsin (18 U/ml), thrombin (12.5 NIH U/ml), urokinase (62500 IU/ml) and elastase (8.4 U/ml) was...
Ligand InfoPC cidPC sid
In DepthDetails ArticlePubMed