BDBM238177 US9394303, 4
SMILES Cc1nn(-c2ccccc2)c2nc(C)cc(C(O)=O)c12
InChI Key InChIKey=GGNIHFFEYHWPQO-UHFFFAOYSA-N
Data  1 KI  1 IC50
  Tab Delimited (TSV)   2D SDfile   Computed 3D by Vconf -m prep SDfile
Find this compound or compounds like it in BindingDB:
Activity Spreadsheet -- Enzyme Inhibition Constant Data from BindingDB
Found 1 hit for monomerid = 238177
TargetInduced myeloid leukemia cell differentiation protein Mcl-1 homolog(Mus musculus (Mouse))
The Regents Of The University Of Michigan
US Patent
LigandPNGBDBM238177(US9394303, 4)
Affinity DataKi:  1.46E+4nM ΔG°:  -6.59kcal/mole IC50:  7.57E+4nMpH: 7.4 T: 2°C. Assay description: Sensitive and quantitative FP-based binding assays were developed and optimized to determine the binding affinities of small-molecule inhibitors to t...
In DepthDetails US Patent