BDBM238180 US9394303, 7
SMILES Cc1nn(Cc2ccc(cc2)-c2ccccc2)c2nc(cc(C(O)=O)c12)-c1ccco1
InChI Key InChIKey=VCOKWPGYJIDRHC-UHFFFAOYSA-N
Data  1 KI  1 IC50
  Tab Delimited (TSV)   2D SDfile   Computed 3D by Vconf -m prep SDfile
Find this compound or compounds like it in BindingDB:
Activity Spreadsheet -- Enzyme Inhibition Constant Data from BindingDB
Found 1 hit for monomerid = 238180
TargetInduced myeloid leukemia cell differentiation protein Mcl-1 homolog(Mus musculus (Mouse))
The Regents Of The University Of Michigan
US Patent
LigandPNGBDBM238180(US9394303, 7)
Affinity DataKi:  1.40E+3nM ΔG°:  -7.98kcal/mole IC50:  7.30E+3nMpH: 7.4 T: 2°C. Assay description: Sensitive and quantitative FP-based binding assays were developed and optimized to determine the binding affinities of small-molecule inhibitors to t...
Ligand InfoPC cidPC sid
In DepthDetails US Patent