BDBM238187 US9394303, 59
SMILES Cc1nn(-c2ccc(Oc3ccccc3)cc2)c2nc(cc(C(O)=O)c12)-c1ccco1
InChI Key InChIKey=QDUROJOWBQMMQA-UHFFFAOYSA-N
Data  1 KI  1 IC50
  Tab Delimited (TSV)   2D SDfile   Computed 3D by Vconf -m prep SDfile
Find this compound or compounds like it in BindingDB:
Activity Spreadsheet -- Enzyme Inhibition Constant Data from BindingDB
Found 1 hit for monomerid = 238187
TargetInduced myeloid leukemia cell differentiation protein Mcl-1 homolog(Mus musculus (Mouse))
The Regents Of The University Of Michigan
US Patent
LigandPNGBDBM238187(US9394303, 59)
Affinity DataKi:  820nM ΔG°:  -8.30kcal/mole IC50:  4.27E+3nMpH: 7.4 T: 2°C. Assay description: Sensitive and quantitative FP-based binding assays were developed and optimized to determine the binding affinities of small-molecule inhibitors to t...
Ligand InfoPC cidPC sid
In DepthDetails US Patent