BDBM238195 US9394303, 61
SMILES Cc1nn(Cc2ccc(Oc3ccccc3)cc2)c2nc(cc(C(O)=O)c12)-c1cccs1
InChI Key InChIKey=AOKJSDQDESVTNU-UHFFFAOYSA-N
Data  1 KI  1 IC50
  Tab Delimited (TSV)   2D SDfile   Computed 3D by Vconf -m prep SDfile
Find this compound or compounds like it in BindingDB:
Activity Spreadsheet -- Enzyme Inhibition Constant Data from BindingDB
Found 1 hit for monomerid = 238195
TargetInduced myeloid leukemia cell differentiation protein Mcl-1 homolog(Mus musculus (Mouse))
The Regents Of The University Of Michigan
US Patent
LigandPNGBDBM238195(US9394303, 61)
Affinity DataKi:  1.30E+3nM ΔG°:  -8.02kcal/mole IC50:  6.76E+3nMpH: 7.4 T: 2°C. Assay description: Sensitive and quantitative FP-based binding assays were developed and optimized to determine the binding affinities of small-molecule inhibitors to t...
Ligand InfoPC cidPC sid
In DepthDetails US Patent