BDBM23851 14-oxapentacyclo[20.2.2.2^{10,13}.1^{15,19}.0^{2,7}]nonacosa-1(25),2(7),3,5,10,12,15,17,19(27),22(26),23,28-dodecaene-5,24-diol::Riccardin C derivative, 20d
SMILES Oc1ccc-2c(CCc3ccc(Oc4cccc(CCc5ccc-2c(O)c5)c4)cc3)c1
InChI Key InChIKey=ZCEPVFMKRVLFDX-UHFFFAOYSA-N
Data  3 IC50
  Tab Delimited (TSV)   2D SDfile   Computed 3D by Vconf -m prep SDfile
Find this compound or compounds like it in BindingDB:
Activity Spreadsheet -- Enzyme Inhibition Constant Data from BindingDB
Found 3 hits for monomerid = 23851
TargetAlpha-glucosidase MAL32(Saccharomyces cerevisiae)
University Of Tokyo
LigandPNGBDBM23851(14-oxapentacyclo[20.2.2.2^{10,13}.1^{15,19}.0^{2,7...)
Affinity DataIC50:  5.10E+3nMpH: 7.0 T: 2°C. Assay description: The alpha-glucosidase inhibitory activity of test compounds was determined in a 96-well plate format. The reaction mixture containing enzyme and chro...
In DepthDetails ArticlePubMed
TargetOxysterols receptor LXR-beta(Homo sapiens (Human))
University Of Tokyo
LigandPNGBDBM23851(14-oxapentacyclo[20.2.2.2^{10,13}.1^{15,19}.0^{2,7...)
Affinity DataIC50:  1.00E+4nM. Assay description: Human embryonic kidney (HEK) 293 cells were cultured in D-MEM medium. Transfections were performed by the calcium phosphate coprecipitation method. T...
In DepthDetails ArticlePubMed
TargetOxysterols receptor LXR-alpha(Homo sapiens (Human))
University Of Tokyo
LigandPNGBDBM23851(14-oxapentacyclo[20.2.2.2^{10,13}.1^{15,19}.0^{2,7...)
Affinity DataIC50:  8.40E+3nM. Assay description: Human embryonic kidney (HEK) 293 cells were cultured in D-MEM medium. Transfections were performed by the calcium phosphate coprecipitation method. T...
In DepthDetails ArticlePubMed