BDBM23854 14-oxapentacyclo[20.2.2.2^{10,13}.1^{15,19}.0^{2,7}]nonacosa-1(24),2(7),3,5,10,12,15,17,19(27),22,25,28-dodecaene::Riccardin C derivative, 22
SMILES C1Cc2cccc(Oc3ccc(CCc4ccccc4-c4ccc1cc4)cc3)c2
InChI Key InChIKey=VHGMCOKOKWHSEA-UHFFFAOYSA-N
Data  3 IC50
  Tab Delimited (TSV)   2D SDfile   Computed 3D by Vconf -m prep SDfile
Find this compound or compounds like it in BindingDB:
Activity Spreadsheet -- Enzyme Inhibition Constant Data from BindingDB
Found 3 hits for monomerid = 23854
TargetAlpha-glucosidase MAL32(Saccharomyces cerevisiae)
University Of Tokyo
LigandPNGBDBM23854(14-oxapentacyclo[20.2.2.2^{10,13}.1^{15,19}.0^{2,7...)
Affinity DataIC50:  1.80E+4nMpH: 7.0 T: 2°C. Assay description: The alpha-glucosidase inhibitory activity of test compounds was determined in a 96-well plate format. The reaction mixture containing enzyme and chro...
In DepthDetails ArticlePubMed
TargetOxysterols receptor LXR-beta(Homo sapiens (Human))
University Of Tokyo
LigandPNGBDBM23854(14-oxapentacyclo[20.2.2.2^{10,13}.1^{15,19}.0^{2,7...)
Affinity DataIC50:  7.70E+4nM. Assay description: Human embryonic kidney (HEK) 293 cells were cultured in D-MEM medium. Transfections were performed by the calcium phosphate coprecipitation method. T...
In DepthDetails ArticlePubMed
TargetOxysterols receptor LXR-alpha(Homo sapiens (Human))
University Of Tokyo
LigandPNGBDBM23854(14-oxapentacyclo[20.2.2.2^{10,13}.1^{15,19}.0^{2,7...)
Affinity DataIC50:  7.10E+3nM. Assay description: Human embryonic kidney (HEK) 293 cells were cultured in D-MEM medium. Transfections were performed by the calcium phosphate coprecipitation method. T...
In DepthDetails ArticlePubMed