BDBM239036 US10028934, Compound 25::US10478423, Cpd. 25::US9408850, 25::US9597317, 25
SMILES O=C(Nc1n[nH]c2cc(OCCOCc3ccccc3)ccc12)c1ccc(NCCN2CCOCC2)cc1
InChI Key InChIKey=LWRYWULQPGJKAZ-UHFFFAOYSA-N
Data  8 IC50
  Tab Delimited (TSV)   2D SDfile   Computed 3D by Vconf -m prep SDfile
Find this compound or compounds like it in BindingDB:
Activity Spreadsheet -- Enzyme Inhibition Constant Data from BindingDB
Found 8 hits for monomerid = 239036
TargetMast/stem cell growth factor receptor Kit [544-976](Homo sapiens (Human))
Nerviano Medical Sciences
US Patent
LigandPNGBDBM239036(US10028934, Compound 25 | US10478423, Cpd. 25 | US...)
Affinity DataIC50:  197nMpH: 7.9Assay Description:The assay has been performed using KIT cytoplasmic domain product and purified in house as GST fused protein. The KIT protein (4.5 microM) was pre ac...
Ligand InfoPC cidPC sid
In DepthDetails US Patent
TargetReceptor-type tyrosine-protein kinase FLT3 [564-993](Homo sapiens (Human))
Nerviano Medical Sciences
US Patent
LigandPNGBDBM239036(US10028934, Compound 25 | US10478423, Cpd. 25 | US...)
Affinity DataIC50:  74nMpH: 7.9 T: 2°C. Assay description: The assay was performed using FLT3 cytoplasmic domain product and purified in house as GST fused protein. The FLT3 protein (1 microM) was pre activat...
Ligand InfoPC cidPC sid
In DepthDetails US Patent
TargetReceptor-type tyrosine-protein kinase FLT3(Homo sapiens (Human))
Nerviano Medical Sciences
US Patent
LigandPNGBDBM239036(US10028934, Compound 25 | US10478423, Cpd. 25 | US...)
Affinity DataIC50:  74nMpH: 7.9Assay Description:i. Enzyme The assay was performed using FLT3 cytoplasmic domain product and purified in house as GST fused protein. The FLT3 protein (1 microM) was p...
Ligand InfoPC cidPC sid
In DepthDetails US Patent
TargetMast/stem cell growth factor receptor Kit(Homo sapiens (Human))
Nerviano Medical Sciences
US Patent
LigandPNGBDBM239036(US10028934, Compound 25 | US10478423, Cpd. 25 | US...)
Affinity DataIC50:  197nM. Assay description: i. Enzyme—The assay has been performed using KIT cytoplasmic domain product and purified in house as GST fused protein. The KIT protein (4.5 microM) ...
Ligand InfoPC cidPC sid
In DepthDetails US Patent
TargetReceptor-type tyrosine-protein kinase FLT3(Homo sapiens (Human))
Nerviano Medical Sciences
US Patent
LigandPNGBDBM239036(US10028934, Compound 25 | US10478423, Cpd. 25 | US...)
Affinity DataIC50:  74nM. Assay description: i. Enzyme The assay was performed using FLT3 cytoplasmic domain product and purified in house as GST fused protein. The FLT3 protein (1 microM) was p...
Ligand InfoPC cidPC sid
In DepthDetails US Patent
TargetMast/stem cell growth factor receptor Kit(Homo sapiens (Human))
Nerviano Medical Sciences
US Patent
LigandPNGBDBM239036(US10028934, Compound 25 | US10478423, Cpd. 25 | US...)
Affinity DataIC50:  197nM. Assay description: i. Enzyme The assay has been performed using KIT cytoplasmic domain product and purified in house as GST fused protein. The KIT protein (4.5 microM) ...
Ligand InfoPC cidPC sid
In DepthDetails US Patent
TargetReceptor-type tyrosine-protein kinase FLT3(Homo sapiens (Human))
Nerviano Medical Sciences
US Patent
LigandPNGBDBM239036(US10028934, Compound 25 | US10478423, Cpd. 25 | US...)
Affinity DataIC50:  74nM. Assay description: i. Enzyme—The assay was performed using FLT3 cytoplasmic domain product and purified in house as GST fused protein. The FLT3 protein (1 microM) was p...
Ligand InfoPC cidPC sid
In DepthDetails US Patent
TargetMast/stem cell growth factor receptor Kit(Homo sapiens (Human))
Nerviano Medical Sciences
US Patent
LigandPNGBDBM239036(US10028934, Compound 25 | US10478423, Cpd. 25 | US...)
Affinity DataIC50:  197nMpH: 7.9Assay Description:i. Enzyme The assay has been performed using KIT cytoplasmic domain product and purified in house as GST fused protein. The KIT protein (4.5 microM) ...
Ligand InfoPC cidPC sid
In DepthDetails US Patent