BDBM24591 (2S)-1-[(2S,3S)-3-hexyl-4-oxooxetan-2-yl]pentadecan-2-yl (2S)-2-formamido-4-methylpentanoate::Orlistat derivative, 15a
SMILES CCCCCCCCCCCCC[C@@H](C[C@@H]1OC(=O)[C@H]1CCCCCC)OC(=O)[C@H](CC(C)C)NC=O
InChI Key InChIKey=LIFQFEPLLRJNQF-DZUOILHNSA-N
Data  1 IC50
  Tab Delimited (TSV)   2D SDfile   Computed 3D by Vconf -m prep SDfile
Find this compound or compounds like it in BindingDB:
Activity Spreadsheet -- Enzyme Inhibition Constant Data from BindingDB
Found 1 hit for monomerid = 24591
TargetFatty acid synthase [2202-2509](Homo sapiens (Human))
The Burnham Institute For Medical Research
LigandPNGBDBM24591((2S)-1-[(2S,3S)-3-hexyl-4-oxooxetan-2-yl]pentadeca...)
Affinity DataIC50:  3.67E+3nMpH: 7.4 T: 2°C. Assay description: The reaction mixture consisted of FAS thioesterase domain (FASTE) in buffer, which was preincubated with test compounds for 30 min. The reaction was ...
In DepthDetails ArticlePubMed