BDBM249243 US9458136, 1
SMILES CC(C)(C)C(CO)NC(=O)c1nn(c2[C@H]3C[C@H]3Cc12)-c1c[n+]([O-])ccn1
InChI Key InChIKey=ACSQLTBPYZSGBA-WAQLSPKVSA-N
Data  1 EC50
  Tab Delimited (TSV)   2D SDfile   Computed 3D by Vconf -m prep SDfile
Find this compound or compounds like it in BindingDB:
Activity Spreadsheet -- Enzyme Inhibition Constant Data from BindingDB
Found 1 hit for monomerid = 249243
TargetCannabinoid receptor 2(Homo sapiens (Human))
Arena Pharmaceuticals
US Patent
LigandPNGBDBM249243(US9458136, 1)
Affinity DataEC50:  5.40nM. Assay description: Compound 1 was screened for agonist activity against the human CB2 receptor using the DiscoveRx PathHunter β-arrestin assay which measures the &...
In DepthDetails US Patent