BDBM25035 N'-[(1E)-1-{6-bromoimidazo[1,2-a]pyridin-3-yl}ethylidene]-N,2-dimethyl-5-nitrobenzene-1-sulfonohydrazide::imidazopyridine derivative, 8b
SMILES CN(N=C(C)c1cnc2ccc(Br)cn12)S(=O)(=O)c1cc(ccc1C)[N+]([O-])=O
InChI Key InChIKey=KKRZFLKUUIPLCW-UHFFFAOYSA-N
Data  1 IC50
  Tab Delimited (TSV)   2D SDfile   Computed 3D by Vconf -m prep SDfile
Find this compound or compounds like it in BindingDB:
Activity Spreadsheet -- Enzyme Inhibition Constant Data from BindingDB
Found 1 hit for monomerid = 25035
LigandPNGBDBM25035(N'-[(1E)-1-{6-bromoimidazo[1,2-a]pyridin-3-yl}ethy...)
Affinity DataIC50:  81nMpH: 7.4 T: 2°C. Assay description: The test compounds and enzyme were mixed in buffer, and the substrate and [gamma-33P] ATP/ATP were added to the mixture to initiate the reaction. Aft...
In DepthDetails ArticlePubMed