BDBM25043 3-[(1E)-{[methyl(2-methyl-5-nitrobenzene)sulfonamido]imino}methyl]imidazo[1,2-a]pyridine-6-carboxamide::imidazopyridine derivative, 8j
SMILES CN(\N=C\c1cnc2ccc(cn12)C(N)=O)S(=O)(=O)c1cc(ccc1C)[N+]([O-])=O
InChI Key InChIKey=MNBUNQCMLJCWQL-AWQFTUOYSA-N
Data  1 IC50
  Tab Delimited (TSV)   2D SDfile   Computed 3D by Vconf -m prep SDfile
Find this compound or compounds like it in BindingDB:
Activity Spreadsheet -- Enzyme Inhibition Constant Data from BindingDB
Found 1 hit for monomerid = 25043
LigandPNGBDBM25043(3-[(1E)-{[methyl(2-methyl-5-nitrobenzene)sulfonami...)
Affinity DataIC50:  780nMpH: 7.4 T: 2°C. Assay description: The test compounds and enzyme were mixed in buffer, and the substrate and [gamma-33P] ATP/ATP were added to the mixture to initiate the reaction. Aft...
In DepthDetails ArticlePubMed