BDBM25048 3-{6-chloro-2-methylimidazo[1,2-a]pyridin-3-yl}-1-[(4-nitrobenzene)sulfonyl]-1H-pyrazole::imidazo[1,2-a]pyridine derivative, 2c
SMILES Cc1nc2ccc(Cl)cn2c1-c1ccn(n1)S(=O)(=O)c1ccc(cc1)[N+]([O-])=O
InChI Key InChIKey=YWSLBNYHOCEYAG-UHFFFAOYSA-N
Data  1 IC50
  Tab Delimited (TSV)   2D SDfile   Computed 3D by Vconf -m prep SDfile
Find this compound or compounds like it in BindingDB:
Activity Spreadsheet -- Enzyme Inhibition Constant Data from BindingDB
Found 1 hit for monomerid = 25048
LigandPNGBDBM25048(3-{6-chloro-2-methylimidazo[1,2-a]pyridin-3-yl}-1-...)
Affinity DataIC50: >3.00E+4nMpH: 7.4 T: 2°C. Assay description: The test compounds and enzyme were mixed in buffer, and the substrate and [gamma-33P] ATP/ATP were added to the mixture to initiate the reaction. Aft...
In DepthDetails ArticlePubMed