BDBM25057 imidazo[1,2-a]pyridine derivative, 14b::{2-[(4-{6-chloroimidazo[1,2-a]pyridin-3-yl}-1,3-thiazole-2-)sulfinyl]-4-nitrophenyl}methanol
SMILES OCc1ccc(cc1S(=O)c1nc(cs1)-c1cnc2ccc(Cl)cn12)[N+]([O-])=O
InChI Key InChIKey=MTPAGVJBMJGOMM-UHFFFAOYSA-N
Data  1 IC50
  Tab Delimited (TSV)   2D SDfile   Computed 3D by Vconf -m prep SDfile
Find this compound or compounds like it in BindingDB:
Activity Spreadsheet -- Enzyme Inhibition Constant Data from BindingDB
Found 1 hit for monomerid = 25057
LigandPNGBDBM25057(imidazo[1,2-a]pyridine derivative, 14b | {2-[(4-{6...)
Affinity DataIC50:  20nMpH: 7.4 T: 2°C. Assay description: The test compounds and enzyme were mixed in buffer, and the substrate and [gamma-33P] ATP/ATP were added to the mixture to initiate the reaction. Aft...
In DepthDetails ArticlePubMed