BDBM25111 4-(4-aminopteridin-7-yl)benzene-1,2-diol::aminopteridine derivative, 33
SMILES Nc1ncnc2nc(cnc12)-c1ccc(O)c(O)c1
InChI Key InChIKey=XBUHCGAFDXGUFA-UHFFFAOYSA-N
Data  1 IC50
  Tab Delimited (TSV)   2D SDfile   Computed 3D by Vconf -m prep SDfile
Find this compound or compounds like it in BindingDB:
Activity Spreadsheet -- Enzyme Inhibition Constant Data from BindingDB
Found 1 hit for monomerid = 25111
LigandPNGBDBM25111(4-(4-aminopteridin-7-yl)benzene-1,2-diol | aminopt...)
Affinity DataIC50:  5.10E+3nM. Assay description: The luminescence-based kinase assay with recombinant phosphatidylinositol 3-kinase (Upstate Cell Signaling Solutions) was used for the determination ...
In DepthDetails ArticlePubMed