BDBM252440 US9458172, 9
SMILES Fc1cc(F)cc(c1)S(=O)c1ccc(CNC(=O)c2cc3cnccc3[nH]2)nc1
InChI Key
Data  1 IC50
  Tab Delimited (TSV)   2D SDfile   Computed 3D by Vconf -m prep SDfile
Find this compound or compounds like it in BindingDB:
Activity Spreadsheet -- Enzyme Inhibition Constant Data from BindingDB
Found 1 hit for monomerid = 252440
TargetNicotinamide phosphoribosyltransferase(Homo sapiens (Human))
TBA
US Patent
LigandPNGBDBM252440(US9458172, 9)
Affinity DataIC50:  55.3nMpH: 7.5Assay Description:The NAMPT Enzymatic Reaction. The NAMPT enzymatic reactions were carried out in Buffer A (50 mM Hepes pH 7.5, 50 mM NaCl, 5 mM MgCl2, and 1 mM THP) i...
Ligand InfoPC cidPC sid
In DepthDetails US Patent