BDBM25281 (9-phosphonoheptadecan-9-yl)phosphonic acid::bisphosphonate, 33
SMILES CCCCCCCCC(CCCCCCCC)(P(O)(O)=O)P(O)(O)=O
InChI Key InChIKey=XTRCZGGLPJAMGQ-UHFFFAOYSA-N
Data  1 IC50
  Tab Delimited (TSV)   2D SDfile   Computed 3D by Vconf -m prep SDfile
Find this compound or compounds like it in BindingDB:
Activity Spreadsheet -- Enzyme Inhibition Constant Data from BindingDB
Found 1 hit for monomerid = 25281
TargetGeranylgeranyl pyrophosphate synthase(Homo sapiens (Human))
National Taiwan University
LigandPNGBDBM25281((9-phosphonoheptadecan-9-yl)phosphonic acid | bisp...)
Affinity DataIC50:  2.51E+3nMpH: 7.0 T: 2°C. Assay description: The inhibitory activity of each test compound was evaluated by monitoring the formation of [14C]GGPP from FPP, using [14C]IPP as the substrate. To co...
In DepthDetails ArticlePubMed