BDBM253020 US9481685, 3
SMILES CCN(CC)C(=O)C1Sc2ccccc2-c2c1c1cccc(OC)c1n2CCF
InChI Key InChIKey=CSWQEZJPOVECNM-UHFFFAOYSA-N
Data  2 KI
  Tab Delimited (TSV)   2D SDfile   Computed 3D by Vconf -m prep SDfile
Find this compound or compounds like it in BindingDB:
Activity Spreadsheet -- Enzyme Inhibition Constant Data from BindingDB
Found 2 hits for monomerid = 253020
TargetTranslocator protein(Rattus norvegicus (rat))
Ge Healthcare
Curated by ChEMBL
LigandPNGBDBM253020(US9481685, 3)
Affinity DataKi:  0.930nM. Assay description: Displacement of [3H]PK11195 from PBR receptor in Wistar rat heart homogenates
Ligand InfoPC cidPC sid
In DepthDetails ArticlePubMed
TargetTranslocator protein(Rattus norvegicus (rat))
Ge Healthcare
Curated by ChEMBL
LigandPNGBDBM253020(US9481685, 3)
Affinity DataKi:  0.930nMpH: 7.4Assay Description:The compounds were screened for their affinity for PBR using a method adapted from Le Fur et al (Life Sci. 1983; USA 33: 449-57).The compounds to be ...
Ligand InfoPC cidPC sid
In DepthDetails US Patent