BDBM25876 4,4-dimethyl-1-{4-[4-(quinolin-2-yl)piperazin-1-yl]butyl}piperidine-2,6-dione::CHEMBL297702::buspirone analogue, 7
SMILES CC1(C)CC(=O)N(CCCCN2CCN(CC2)c2ccc3ccccc3n2)C(=O)C1
InChI Key InChIKey=BMDBAQIDESDSEP-UHFFFAOYSA-N
Data  2 KI  2 IC50
  Tab Delimited (TSV)   2D SDfile   Computed 3D by Vconf -m prep SDfile
Find this compound or compounds like it in BindingDB:
Activity Spreadsheet -- Enzyme Inhibition Constant Data from BindingDB
Found 2 hits for monomerid = 25876
Target5-hydroxytryptamine receptor 1A(Homo sapiens (Human))
National Medicines Institute
Curated by ChEMBL
LigandPNGBDBM25876(4,4-dimethyl-1-{4-[4-(quinolin-2-yl)piperazin-1-yl...)
Affinity DataKi:  11nM. Assay description: Displacement of [3H]8-OH-DPAT from 5HT1A receptor in cerebral cortex homogenates after 15 mins
In DepthDetails ArticlePubMed
TargetSodium-dependent serotonin transporter(Rattus norvegicus (rat))
National Medicines Institute
Curated by ChEMBL
LigandPNGBDBM25876(4,4-dimethyl-1-{4-[4-(quinolin-2-yl)piperazin-1-yl...)
Affinity DataIC50:  146nM. Assay description: Displacement of [3H]-Citalopram from SERT in rat cerebral cortex homogenates after 1 hr by liquid scintillation counter
In DepthDetails ArticlePubMed