BDBM26101 5-{4-[3-(trifluoromethyl)phenyl]phenyl}-1,2-oxazole-3-carboxylic acid::Isoxazole carboxylic acid, 16
SMILES OC(=O)c1cc(on1)-c1ccc(cc1)-c1cccc(c1)C(F)(F)F
InChI Key InChIKey=CRBAAYIDMGMAEW-UHFFFAOYSA-N
Data  1 KI
  Tab Delimited (TSV)   2D SDfile   Computed 3D by Vconf -m prep SDfile
Find this compound or compounds like it in BindingDB:
Activity Spreadsheet -- Enzyme Inhibition Constant Data from BindingDB
Found 1 hit for monomerid = 26101
TargetTYR_PHOSPHATASE_2 domain-containing protein(Mycobacterium tuberculosis)
University Of California Berkeley
LigandPNGBDBM26101(5-{4-[3-(trifluoromethyl)phenyl]phenyl}-1,2-oxazol...)
Affinity DataKi:  2.50E+3nM ΔG°:  -7.56kcal/molepH: 7.4 T: 2°C. Assay description: The reaction was started by addition of pNPP substrate, and reaction progress was monitored at 405 nm. The initial rate data collected was used for d...
In DepthDetails ArticlePubMed