BDBM26155 2,4-dianilino pyrimidine, 12::3-({4-[(5-chloro-2-methylphenyl)amino]pyrimidin-2-yl}amino)benzamide
SMILES Cc1ccc(Cl)cc1Nc1ccnc(Nc2cccc(c2)C(N)=O)n1
InChI Key InChIKey=UJEWVYVKAAISMF-UHFFFAOYSA-N
Data  1 IC50
  Tab Delimited (TSV)   2D SDfile   Computed 3D by Vconf -m prep SDfile
Find this compound or compounds like it in BindingDB:
Activity Spreadsheet -- Enzyme Inhibition Constant Data from BindingDB
Found 1 hit for monomerid = 26155
LigandPNGBDBM26155(2,4-dianilino pyrimidine, 12 | 3-({4-[(5-chloro-2-...)
Affinity DataIC50:  380nMpH: 7.4 T: 2°C. Assay description: Lck activity was assessed using a TR-FRET assay in a 384-well plate format. The degree of phosphorylation of Biotinylated substrate was measured usin...
In DepthDetails ArticlePubMed