BDBM26212 (3S,6S,9aS)-6-[(2S)-2-aminopropanamido]-N-(diphenylmethyl)-5-oxo-octahydro-1H-pyrrolo[1,2-a]azepine-3-carboxamide::bicyclic Smac peptide mimetic, 11
SMILES C[C@H](N)C(=O)N[C@H]1CCC[C@H]2CC[C@H](N2C1=O)C(=O)NC(c1ccccc1)c1ccccc1
InChI Key InChIKey=JHJTWSSGXYISJM-MQGJPIDWSA-N
Data  1 KI
  Tab Delimited (TSV)   2D SDfile   Computed 3D by Vconf -m prep SDfile
Find this compound or compounds like it in BindingDB:
Activity Spreadsheet -- Enzyme Inhibition Constant Data from BindingDB
Found 1 hit for monomerid = 26212
TargetE3 ubiquitin-protein ligase XIAP [241-356](Homo sapiens (Human))
University Of Michigan
LigandPNGBDBM26212((3S,6S,9aS)-6-[(2S)-2-aminopropanamido]-N-(dipheny...)
Affinity DataKi:  60nM ΔG°:  -9.75kcal/molepH: 7.5 T: 2°C. Assay description: Fluorescence polarization was measured on an Ultra plate reader at excitation and emission wavelengths of 485 and 530 nm, respectively. The equilibri...
In DepthDetails ArticlePubMed