BDBM262330 Methyl 4-(2-sulfamoyl-3-(1H-tetrazol-5-yl)pyridin-4-yl)benzoate::US9708336, 182
SMILES COC(=O)c1ccc(cc1)-c1ccnc(c1-c1nnn[nH]1)S(N)(=O)=O
InChI Key InChIKey=FVNSWQDCPIYBIH-UHFFFAOYSA-N
Data  3 IC50
  Tab Delimited (TSV)   2D SDfile   Computed 3D by Vconf -m prep SDfile
Find this compound or compounds like it in BindingDB:
Activity Spreadsheet -- Enzyme Inhibition Constant Data from BindingDB
Found 3 hits for monomerid = 262330
TargetMetallo-beta-lactamase type 2(Serratia marcescens)
Merck Sharp & Dohme
US Patent
LigandPNGBDBM262330(Methyl 4-(2-sulfamoyl-3-(1H-tetrazol-5-yl)pyridin-...)
Affinity DataIC50:  348nMpH: 7.0Assay Description:The Class B enzyme activities were measured in the presence of the test inhibitor in a fluorescence assay against a commercially available substrate ...
Ligand InfoPC cidPC sid
In DepthDetails US Patent
TargetVIM-1 metallo-beta-lactamase(Klebsiella pneumoniae)
Merck Sharp & Dohme
US Patent
LigandPNGBDBM262330(Methyl 4-(2-sulfamoyl-3-(1H-tetrazol-5-yl)pyridin-...)
Affinity DataIC50:  91.4nMpH: 7.0Assay Description:The Class B enzyme activities were measured in the presence of the test inhibitor in a fluorescence assay against a commercially available substrate ...
Ligand InfoPC cidPC sid
In DepthDetails US Patent
TargetMetallo-beta-lactamase type 2(Klebsiella pneumoniae)
Merck Sharp & Dohme
US Patent
LigandPNGBDBM262330(Methyl 4-(2-sulfamoyl-3-(1H-tetrazol-5-yl)pyridin-...)
Affinity DataIC50:  32.4nMpH: 7.0Assay Description:The Class B enzyme activities were measured in the presence of the test inhibitor in a fluorescence assay against a commercially available substrate ...
Ligand InfoPC cidPC sid
In DepthDetails US Patent