BDBM26476 5-({2-[(3-bromophenyl)amino]pyrimidin-4-yl}amino)-2-methylphenol::pyrimidine, 3
SMILES Cc1ccc(Nc2ccnc(Nc3cccc(Br)c3)n2)cc1O
InChI Key InChIKey=CEXKXUHVXAGOLB-UHFFFAOYSA-N
Data  1 IC50
  Tab Delimited (TSV)   2D SDfile   Computed 3D by Vconf -m prep SDfile
Find this compound or compounds like it in BindingDB:
Activity Spreadsheet -- Enzyme Inhibition Constant Data from BindingDB
Found 1 hit for monomerid = 26476
TargetVascular endothelial growth factor receptor 2(Homo sapiens (Human))
Gsk
LigandPNGBDBM26476(5-({2-[(3-bromophenyl)amino]pyrimidin-4-yl}amino)-...)
Affinity DataIC50:  6.30nMpH: 7.5 T: 2°C. Assay description: The assay uses purified baculovirus-expressed GST-VEGFR2 interacting with biotinylated peptide substrates. HTRF is based on the proximity of europium...
Ligand InfoPC cidPC sid
In DepthDetails ArticlePubMed