BDBM27258 Boc-indole derivative, 16::tert-butyl 2-[4-(2-{[5-(pyridin-2-yl)thiophene-2-]sulfonamido}ethyl)phenyl]-1H-indole-1-carboxylate
SMILES CC(C)(C)OC(=O)n1c(cc2ccccc12)-c1ccc(CCNS(=O)(=O)c2ccc(s2)-c2ccccn2)cc1
InChI Key InChIKey=SGIRNEGPFZYLSL-UHFFFAOYSA-N
Data  1 EC50
  Tab Delimited (TSV)   2D SDfile   Computed 3D by Vconf -m prep SDfile
Find this compound or compounds like it in BindingDB:
Activity Spreadsheet -- Enzyme Inhibition Constant Data from BindingDB
Found 1 hit for monomerid = 27258
TargetOxysterols receptor LXR-beta(Homo sapiens (Human))
Tanabe Research Laboratories Usa
LigandPNGBDBM27258(Boc-indole derivative, 16 | tert-butyl 2-[4-(2-{[5...)
Affinity DataEC50:  230nMpH: 7.5 T: 2°C. Assay description: Polyhistidine-tagged human LXR ligand-binding domain was mixed with the test compound, biotin-SRC1 peptide, streptavidin-allophycocyanin, and europiu...
In DepthDetails ArticlePubMed