BDBM27263 Boc-indole derivative, 21::tert-butyl 2-[4-(cyanomethyl)phenyl]-1H-indole-1-carboxylate
SMILES CC(C)(C)OC(=O)n1c(cc2ccccc12)-c1ccc(CC#N)cc1
InChI Key InChIKey=USXVGBNPSOPVMP-UHFFFAOYSA-N
Data  1 EC50
  Tab Delimited (TSV)   2D SDfile   Computed 3D by Vconf -m prep SDfile
Find this compound or compounds like it in BindingDB:
Activity Spreadsheet -- Enzyme Inhibition Constant Data from BindingDB
Found 1 hit for monomerid = 27263
TargetOxysterols receptor LXR-beta(Homo sapiens (Human))
Tanabe Research Laboratories Usa
LigandPNGBDBM27263(Boc-indole derivative, 21 | tert-butyl 2-[4-(cyano...)
Affinity DataEC50:  300nMpH: 7.5 T: 2°C. Assay description: Polyhistidine-tagged human LXR ligand-binding domain was mixed with the test compound, biotin-SRC1 peptide, streptavidin-allophycocyanin, and europiu...
In DepthDetails ArticlePubMed