BDBM27270 Boc-indole derivative, 28::tert-butyl 2-{4-[2-(methylcarbamoyl)ethyl]phenyl}-1H-indole-1-carboxylate
SMILES CNC(=O)CCc1ccc(cc1)-c1cc2ccccc2n1C(=O)OC(C)(C)C
InChI Key InChIKey=YTOCQJJZBNKKDQ-UHFFFAOYSA-N
Data  1 EC50
  Tab Delimited (TSV)   2D SDfile   Computed 3D by Vconf -m prep SDfile
Find this compound or compounds like it in BindingDB:
Activity Spreadsheet -- Enzyme Inhibition Constant Data from BindingDB
Found 1 hit for monomerid = 27270
TargetOxysterols receptor LXR-beta(Homo sapiens (Human))
Tanabe Research Laboratories Usa
LigandPNGBDBM27270(Boc-indole derivative, 28 | tert-butyl 2-{4-[2-(me...)
Affinity DataEC50:  490nMpH: 7.5 T: 2°C. Assay description: Polyhistidine-tagged human LXR ligand-binding domain was mixed with the test compound, biotin-SRC1 peptide, streptavidin-allophycocyanin, and europiu...
In DepthDetails ArticlePubMed