BDBM275768 CYCLIC CIDOFOVIR::Cyclic-hpmpc::US10071110, Compound Cyclic Cidofovir (cDCV)::US10071110, Compound cCDV
SMILES Nc1ccn(CC2COP(O)(=O)CO2)c(=O)n1
InChI Key InChIKey=YXQUGSXUDFTPLL-UHFFFAOYSA-N
Data  5 EC50
  Tab Delimited (TSV)   2D SDfile   Computed 3D by Vconf -m prep SDfile
Find this compound or compounds like it in BindingDB:
Activity Spreadsheet -- Enzyme Inhibition Constant Data from BindingDB
Found 5 hits for monomerid = 275768
TargetFibroblast growth factor receptor 1(Homo sapiens (Human))
The Regents Of The University Of California
US Patent
LigandPNGBDBM275768(CYCLIC CIDOFOVIR | Cyclic-hpmpc | US10071110, Comp...)
Affinity DataEC50:  470nM. Assay description: Subconfluent human lung fibroblast cells (MRC-5, American Type Culture Collection, Rockville, Md.) in 24-well plates were treated with drugs diluted ...
Ligand InfoPC cidPC sid
In DepthDetails US Patent
TargetFibroblast growth factor receptor 1(Homo sapiens (Human))
The Regents Of The University Of California
US Patent
LigandPNGBDBM275768(CYCLIC CIDOFOVIR | Cyclic-hpmpc | US10071110, Comp...)
Affinity DataEC50:  970nM. Assay description: The activity of cidofovir (CDV), cyclic cidofovir (cCDV), and 1-O-hexadecylpropanediol-3-cCDV (HDP-cCDV) were tested for antiviral activity in human ...
Ligand InfoPC cidPC sid
In DepthDetails US Patent
TargetCapsid scaffolding protein(Human cytomegalovirus (strain AD169) (HHV-5) (Huma...)
The Regents Of The University Of California
US Patent
LigandPNGBDBM275768(CYCLIC CIDOFOVIR | Cyclic-hpmpc | US10071110, Comp...)
Affinity DataEC50:  470nM. Assay description: Antiviral assays for HCMV DNA were carried out by DNA hybridization as reported by Dankner, W. M., Scholl, D., Stanat, S. C., Martin, M., Souke, R. L...
Ligand InfoPC cidPC sid
In DepthDetails US Patent
TargetHIV-1 protease(Human immunodeficiency virus)
The Regents Of The University Of California
US Patent
LigandPNGBDBM275768(CYCLIC CIDOFOVIR | Cyclic-hpmpc | US10071110, Comp...)
Affinity DataEC50:  2.10E+3nM. Assay description: Subconfluent MRC-5 cells in 24-well culture dishes were inoculated by removing the medium and adding HSV-1 virus at a dilution that will result in a ...
Ligand InfoPC cidPC sid
In DepthDetails US Patent
TargetFibroblast growth factor receptor 1(Homo sapiens (Human))
The Regents Of The University Of California
US Patent
LigandPNGBDBM275768(CYCLIC CIDOFOVIR | Cyclic-hpmpc | US10071110, Comp...)
Affinity DataEC50:  720nM. Assay description: The activity of cidofovir (CDV), cyclic cidofovir (cCDV), and 1-O-hexadecylpropanediol-3-cCDV (HDP-cCDV) were tested for antiviral activity in human ...
Ligand InfoPC cidPC sid
In DepthDetails US Patent