BDBM27621 N-[(1S)-1-(3-aminophenyl)ethyl]-6-chloropyrazin-2-amine::alpha-methylbenzylamino pyrazine deriv., 3
SMILES C[C@H](Nc1cncc(Cl)n1)c1cccc(N)c1
InChI Key InChIKey=JPSLARLPNXWTJH-QMMMGPOBSA-N
Data  1 IC50
  Tab Delimited (TSV)   2D SDfile   Computed 3D by Vconf -m prep SDfile
Find this compound or compounds like it in BindingDB:
Activity Spreadsheet -- Enzyme Inhibition Constant Data from BindingDB
Found 1 hit for monomerid = 27621
TargetMacrophage colony-stimulating factor 1 receptor(Homo sapiens (Human))
Cytopia Research
LigandPNGBDBM27621(N-[(1S)-1-(3-aminophenyl)ethyl]-6-chloropyrazin-2-...)
Affinity DataIC50: >5.00E+3nMpH: 7.5 T: 2°C. Assay description: Kinase assays were performed in 384 well Optiplates (Packard) using an Alphascreen Protein Tyrosine Kinase kit. Inhibitors were added to the mixtures...
In DepthDetails ArticlePubMed