BDBM27627 N-{3-[(1S)-1-[(6-chloropyrazin-2-yl)amino]ethyl]phenyl}-5-methylpyridine-3-carboxamide::alpha-methylbenzylamino pyrazine deriv., 9
SMILES C[C@H](Nc1cncc(Cl)n1)c1cccc(NC(=O)c2cncc(C)c2)c1
InChI Key InChIKey=ZOIKCWYGLUSHBS-ZDUSSCGKSA-N
Data  1 IC50
  Tab Delimited (TSV)   2D SDfile   Computed 3D by Vconf -m prep SDfile
Find this compound or compounds like it in BindingDB:
Activity Spreadsheet -- Enzyme Inhibition Constant Data from BindingDB
Found 1 hit for monomerid = 27627
TargetMacrophage colony-stimulating factor 1 receptor(Homo sapiens (Human))
Cytopia Research
LigandPNGBDBM27627(N-{3-[(1S)-1-[(6-chloropyrazin-2-yl)amino]ethyl]ph...)
Affinity DataIC50:  5nMpH: 7.5 T: 2°C. Assay description: Kinase assays were performed in 384 well Optiplates (Packard) using an Alphascreen Protein Tyrosine Kinase kit. Inhibitors were added to the mixtures...
In DepthDetails ArticlePubMed