BDBM27628 5-bromo-N-{3-[(1S)-1-[(6-chloropyrazin-2-yl)amino]ethyl]phenyl}pyridine-3-carboxamide::alpha-methylbenzylamino pyrazine deriv., 10
SMILES C[C@H](Nc1cncc(Cl)n1)c1cccc(NC(=O)c2cncc(Br)c2)c1
InChI Key InChIKey=YNVAWUXFMSZUHQ-NSHDSACASA-N
Data  1 IC50
  Tab Delimited (TSV)   2D SDfile   Computed 3D by Vconf -m prep SDfile
Find this compound or compounds like it in BindingDB:
Activity Spreadsheet -- Enzyme Inhibition Constant Data from BindingDB
Found 1 hit for monomerid = 27628
TargetMacrophage colony-stimulating factor 1 receptor(Homo sapiens (Human))
Cytopia Research
LigandPNGBDBM27628(5-bromo-N-{3-[(1S)-1-[(6-chloropyrazin-2-yl)amino]...)
Affinity DataIC50:  4nMpH: 7.5 T: 2°C. Assay description: Kinase assays were performed in 384 well Optiplates (Packard) using an Alphascreen Protein Tyrosine Kinase kit. Inhibitors were added to the mixtures...
In DepthDetails ArticlePubMed