BDBM27650 1-(5-{[(2S)-2-aminopropanamido]methyl}thiophen-3-yl)-N-benzyl-3-(trifluoromethyl)-1H-pyrazole-5-carboxamide::pyrazole scaffold, 7c
SMILES C[C@H](N)C(=O)NCc1cc(cs1)-n1nc(cc1C(=O)NCc1ccccc1)C(F)(F)F
InChI Key InChIKey=MNESFLXWDRHBTN-LBPRGKRZSA-N
Data  1 IC50
  Tab Delimited (TSV)   2D SDfile   Computed 3D by Vconf -m prep SDfile
Find this compound or compounds like it in BindingDB:
Activity Spreadsheet -- Enzyme Inhibition Constant Data from BindingDB
Found 1 hit for monomerid = 27650
TargetHistone-arginine methyltransferase CARM1(Mus musculus (mouse))
Methylgene
LigandPNGBDBM27650(1-(5-{[(2S)-2-aminopropanamido]methyl}thiophen-3-y...)
Affinity DataIC50:  220nMpH: 9.0 T: 2°C. Assay description: Histone H3 is used as the substrate for CARM-1 enzyme, and the methylation is monitored using tritiated S-Adenosyl-Methionine (SAM) as a methyl donor...
In DepthDetails ArticlePubMed