BDBM27750 3,7-bis[(4-fluorophenyl)methyl]-9-hydroxy-5-methoxy-6H,7H,8H-pyrrolo[3,4-g]quinolin-8-one::tricyclic pyrroloquinoline, 11
SMILES COc1c2CN(Cc3ccc(F)cc3)C(=O)c2c(O)c2ncc(Cc3ccc(F)cc3)cc12
InChI Key InChIKey=QMXPMYKXLRRXLH-UHFFFAOYSA-N
Data  1 IC50
  Tab Delimited (TSV)   2D SDfile   Computed 3D by Vconf -m prep SDfile
Find this compound or compounds like it in BindingDB:
Activity Spreadsheet -- Enzyme Inhibition Constant Data from BindingDB
Found 1 hit for monomerid = 27750
TargetGag-Pol polyprotein [1148-1435](Human immunodeficiency virus type 1)
Gilead Sciences
LigandPNGBDBM27750(3,7-bis[(4-fluorophenyl)methyl]-9-hydroxy-5-methox...)
Affinity DataIC50:  600nMpH: 7.3 T: 2°C. Assay description: In the strand-transfer assay, the biotinylated donor DNA was bound to streptavidin-coated plates, and integrase was added to each well to allow proce...
In DepthDetails ArticlePubMed