BDBM278561 (2E)-3-(1-{[3-(2,6-Dichlorophenyl)-5-(propan-2-yl)-1,2-oxazol-4-yl]carbonyl}-1H-indol-4-yl)prop-2-enoic acid ::US10040791, Example 23
SMILES CC(C)c1onc(c1C(=O)n1ccc2c(\C=C\C(O)=O)cccc12)-c1c(Cl)cccc1Cl
InChI Key InChIKey=KADGEUCPGOYAHO-MDZDMXLPSA-N
Data  2 IC50
  Tab Delimited (TSV)   2D SDfile   Computed 3D by Vconf -m prep SDfile
Find this compound or compounds like it in BindingDB:
Activity Spreadsheet -- Enzyme Inhibition Constant Data from BindingDB
Found 2 hits for monomerid = 278561
TargetIsocitrate dehydrogenase [NADP] cytoplasmic [R132C](Homo sapiens (Human))
Daiichi Sankyo
US Patent
LigandPNGBDBM278561( (2E)-3-(1-{[3-(2,6-Dichlorophenyl)-5-(propan-2-yl...)
Affinity DataIC50:  75nMpH: 7.5 T: 2°C. Assay description: The IDH1R132H protein and the IDH1R132C protein were prepared as follows: the IDH1R132H or IDH1R132C gene was integrated into a pET24b(+) vector (Nov...
Ligand InfoPC cidPC sid
In DepthDetails US Patent
TargetIsocitrate dehydrogenase [NADP] cytoplasmic [R132H](Homo sapiens (Human))
Daiichi Sankyo
US Patent
LigandPNGBDBM278561( (2E)-3-(1-{[3-(2,6-Dichlorophenyl)-5-(propan-2-yl...)
Affinity DataIC50:  6nMpH: 7.5 T: 2°C. Assay description: The IDH1R132H protein and the IDH1R132C protein were prepared as follows: the IDH1R132H or IDH1R132C gene was integrated into a pET24b(+) vector (Nov...
Ligand InfoPC cidPC sid
In DepthDetails US Patent