BDBM278588 (2E)-3-(7-Fluoro-1-{[5-(2- fluoropropan-2-yl)-3-(2,4,6- trichlorophenyl)-1,2-oxazol-4- yl]carbonyl}-3-methyl-1H- indol-4-yl)prop-2-enoic acid ::US10040791, Example 50
SMILES Cc1cn(C(=O)c2c(noc2C(C)(C)F)-c2c(Cl)cc(Cl)cc2Cl)c2c(F)ccc(\C=C\C(O)=O)c12
InChI Key InChIKey=XUYRICDZVZLNIE-FNORWQNLSA-N
Data  2 IC50
  Tab Delimited (TSV)   2D SDfile   Computed 3D by Vconf -m prep SDfile
Find this compound or compounds like it in BindingDB:
Activity Spreadsheet -- Enzyme Inhibition Constant Data from BindingDB
Found 2 hits for monomerid = 278588
TargetIsocitrate dehydrogenase [NADP] cytoplasmic [R132C](Homo sapiens (Human))
Daiichi Sankyo
US Patent
LigandPNGBDBM278588((2E)-3-(7-Fluoro-1-{[5-(2- fluoropropan-2-yl)-3-(2...)
Affinity DataIC50:  104nMpH: 7.5 T: 2°C. Assay description: The IDH1R132H protein and the IDH1R132C protein were prepared as follows: the IDH1R132H or IDH1R132C gene was integrated into a pET24b(+) vector (Nov...
Ligand InfoPC cidPC sid
In DepthDetails US Patent
TargetIsocitrate dehydrogenase [NADP] cytoplasmic [R132H](Homo sapiens (Human))
Daiichi Sankyo
US Patent
LigandPNGBDBM278588((2E)-3-(7-Fluoro-1-{[5-(2- fluoropropan-2-yl)-3-(2...)
Affinity DataIC50:  11nMpH: 7.5 T: 2°C. Assay description: The IDH1R132H protein and the IDH1R132C protein were prepared as follows: the IDH1R132H or IDH1R132C gene was integrated into a pET24b(+) vector (Nov...
Ligand InfoPC cidPC sid
In DepthDetails US Patent