BDBM28077 (4Z)-6-(furan-3-yl)-4-({[4-(piperidin-1-ylmethyl)phenyl]amino}methylidene)-1,2,3,4-tetrahydroisoquinoline-1,3-dione::CHEMBL260864::isoquinolinedione, 32
SMILES O=C1NC(=O)c2ccc(cc2C1=CNc1ccc(CN2CCCCC2)cc1)-c1ccoc1
InChI Key InChIKey=VFJQYKOAZFSECZ-UHFFFAOYSA-N
Data  4 IC50
  Tab Delimited (TSV)   2D SDfile   Computed 3D by Vconf -m prep SDfile
Find this compound or compounds like it in BindingDB:
Activity Spreadsheet -- Enzyme Inhibition Constant Data from BindingDB
Found 4 hits for monomerid = 28077
TargetInsulin-like growth factor 1 receptor(Homo sapiens (Human))
Wyeth Research
LigandPNGBDBM28077((4Z)-6-(furan-3-yl)-4-({[4-(piperidin-1-ylmethyl)p...)
Affinity DataIC50:  715nM. Assay description: Assays were performed in microtiter plates in reaction buffer containing biotinylated substrate, ATP, and purified kinase in the presence of test com...
In DepthDetails ArticlePubMed
TargetCyclin-dependent kinase 1(Homo sapiens (Human))
Wyeth Research
Curated by ChEMBL
LigandPNGBDBM28077((4Z)-6-(furan-3-yl)-4-({[4-(piperidin-1-ylmethyl)p...)
Affinity DataIC50: >5.00E+4nM. Assay description: Inhibition of CDK1/Cyclin B1 (unknown origin) expressed in Sf9 cells-baculovirus system assessed as retinoblastoma susceptibility gene product phosph...
In DepthDetails ArticlePubMed
TargetCyclin-dependent kinase 4(Homo sapiens (Human))
Wyeth Research
Curated by ChEMBL
LigandPNGBDBM28077((4Z)-6-(furan-3-yl)-4-({[4-(piperidin-1-ylmethyl)p...)
Affinity DataIC50:  37nM. Assay description: Inhibition of CDK4/cyclin D1 (unknown origin) expressed in Sf9 cells-baculovirus system assessed as retinoblastoma susceptibility gene product phosph...
In DepthDetails ArticlePubMed
TargetCyclin-dependent kinase 2(Homo sapiens (Human))
Wyeth Research
Curated by ChEMBL
LigandPNGBDBM28077((4Z)-6-(furan-3-yl)-4-({[4-(piperidin-1-ylmethyl)p...)
Affinity DataIC50: >5.00E+4nM. Assay description: Inhibition of CDK2/cyclin E (unknown origin) expressed in Sf9 cells-baculovirus system assessed as retinoblastoma susceptibility gene product phospho...
In DepthDetails ArticlePubMed