BDBM28114 3-cyanoquinoline, 39::4-({3-chloro-4-[(1-ethyl-4,5-dimethyl-1H-imidazol-2-yl)sulfanyl]phenyl}amino)-7-[3-(4-acetylpiperazin-1-yl)propoxy]-6-methoxyquinoline-3-carbonitrile
SMILES CCn1c(C)c(C)nc1Sc1ccc(Nc2c(cnc3cc(OCCCN4CCN(CC4)C(C)=O)c(OC)cc23)C#N)cc1Cl
InChI Key InChIKey=XWLMXDBMXFBVHZ-UHFFFAOYSA-N
Data  1 IC50
  Tab Delimited (TSV)   2D SDfile   Computed 3D by Vconf -m prep SDfile
Find this compound or compounds like it in BindingDB:
Activity Spreadsheet -- Enzyme Inhibition Constant Data from BindingDB
Found 1 hit for monomerid = 28114
TargetInsulin-like growth factor 1 receptor(Homo sapiens (Human))
Wyeth Research
LigandPNGBDBM28114(3-cyanoquinoline, 39 | 4-({3-chloro-4-[(1-ethyl-4,...)
Affinity DataIC50:  16nM. Assay description: Assays were performed in microtiter plates in reaction buffer containing biotinylated substrate, ATP, and purified kinase in the presence of test com...
In DepthDetails ArticlePubMed