BDBM28120 3-cyanoquinoline, 5::4-({3-chloro-4-[(1-methyl-1H-imidazol-2-yl)sulfanyl]phenyl}amino)-7-{[3-(dimethylamino)propyl]amino}-6-methoxyquinoline-3-carbonitrile
SMILES COc1cc2c(Nc3ccc(Sc4nccn4C)c(Cl)c3)c(cnc2cc1NCCCN(C)C)C#N
InChI Key InChIKey=WWYUMKLLEQVAJT-UHFFFAOYSA-N
Data  1 IC50
  Tab Delimited (TSV)   2D SDfile   Computed 3D by Vconf -m prep SDfile
Find this compound or compounds like it in BindingDB:
Activity Spreadsheet -- Enzyme Inhibition Constant Data from BindingDB
Found 1 hit for monomerid = 28120
TargetInsulin-like growth factor 1 receptor(Homo sapiens (Human))
Wyeth Research
LigandPNGBDBM28120(3-cyanoquinoline, 5 | 4-({3-chloro-4-[(1-methyl-1H...)
Affinity DataIC50:  151nM. Assay description: Assays were performed in microtiter plates in reaction buffer containing biotinylated substrate, ATP, and purified kinase in the presence of test com...
In DepthDetails ArticlePubMed