BDBM283218 4-[2-(4-amino-piperidin-1-yl)-5- (6-methoxy-pyridin-3-yl)-1-methyl- 6-oxo-1,6-dihydro-pyrimidin-4- yl]-2-fluoro-benzonitrile::US10023543, Example 9::US10207999, Example 9::US10328077, Example 9::US10548896, Example 9::US10849898, Example 9::US10960005, Example 9::US11084793, Example 9::US9573930, Example 9::US9771329, Example 9::US9776974, Example 9
SMILES Cc1ccc(cn1)-c1c(nc(N2CCC(N)CC2)n(C)c1=O)-c1ccc(C#N)c(F)c1
InChI Key InChIKey=PVAIJGPZPUEVFH-UHFFFAOYSA-N
Data  12 IC50
  Tab Delimited (TSV)   2D SDfile   Computed 3D by Vconf -m prep SDfile
Find this compound or compounds like it in BindingDB:
Activity Spreadsheet -- Enzyme Inhibition Constant Data from BindingDB
Found 12 hits for monomerid = 283218
TargetLysine-specific histone demethylase 1A(Homo sapiens (Human))
Celgene Quanticel Research
US Patent
LigandPNGBDBM283218(4-[2-(4-amino-piperidin-1-yl)-5- (6-methoxy-pyridi...)
Affinity DataIC50: <100nMT: 2°C. Assay description: This assay determines the ability of a test compound to inhibit LSD1 demethylase activity. E. coli expressed full-length human LSD1 (Accession number...
Ligand InfoPC cidPC sid
In DepthDetails US Patent
TargetLysine-specific histone demethylase 1A(Homo sapiens (Human))
Celgene Quanticel Research
US Patent
LigandPNGBDBM283218(4-[2-(4-amino-piperidin-1-yl)-5- (6-methoxy-pyridi...)
Affinity DataIC50: <100nMT: 2°C. Assay description: This assay determines the ability of a test compound to inhibit LSD1 demethylase activity. E. coli expressed full-length human LSD1 (Accession number...
Ligand InfoPC cidPC sid
In DepthDetails US Patent
TargetLysine-specific histone demethylase 1A(Homo sapiens (Human))
Celgene Quanticel Research
US Patent
LigandPNGBDBM283218(4-[2-(4-amino-piperidin-1-yl)-5- (6-methoxy-pyridi...)
Affinity DataIC50: <100nM. Assay description: The enzymatic assay of LSD1 activity is based on Time Resolved-Fluorescence Resonance Energy Transfer (TR-FRET) detection. The inhibitory properties ...
Ligand InfoPC cidPC sid
In DepthDetails US Patent
TargetLysine-specific histone demethylase 1A(Homo sapiens (Human))
Celgene Quanticel Research
US Patent
LigandPNGBDBM283218(4-[2-(4-amino-piperidin-1-yl)-5- (6-methoxy-pyridi...)
Affinity DataIC50: <100nM. Assay description: The enzymatic assay of LSD1 activity is based on Time Resolved-Fluorescence Resonance Energy Transfer (TR-FRET) detection. The inhibitory properties ...
Ligand InfoPC cidPC sid
In DepthDetails US Patent
TargetLysine-specific histone demethylase 1A(Homo sapiens (Human))
Celgene Quanticel Research
US Patent
LigandPNGBDBM283218(4-[2-(4-amino-piperidin-1-yl)-5- (6-methoxy-pyridi...)
Affinity DataIC50: <100nM. Assay description: This assay determines the ability of a test compound to inhibit LSD-1 demethylase activity. E. coli expressed full-length human LSD-1 (Accession numb...
Ligand InfoPC cidPC sid
In DepthDetails US Patent
TargetLysine-specific histone demethylase 1A(Homo sapiens (Human))
Celgene Quanticel Research
US Patent
LigandPNGBDBM283218(4-[2-(4-amino-piperidin-1-yl)-5- (6-methoxy-pyridi...)
Affinity DataIC50: <100nM. Assay description: This assay determines the ability of a test compound to inhibit LSD1 demethylase activity. E. coli expressed full-length human LSD1 (Accession number...
Ligand InfoPC cidPC sid
In DepthDetails US Patent
TargetLysine-specific histone demethylase 1A(Homo sapiens (Human))
Celgene Quanticel Research
US Patent
LigandPNGBDBM283218(4-[2-(4-amino-piperidin-1-yl)-5- (6-methoxy-pyridi...)
Affinity DataIC50: <100nM. Assay description: To analyze LSD1 inhibitor efficacy in cells, a CD11b flow cytometry assay was performed. LSD1 inhibition induces CD11b expression in THP-1 (AML) cell...
Ligand InfoPC cidPC sid
In DepthDetails US Patent
TargetLysine-specific histone demethylase 1A(Homo sapiens (Human))
Celgene Quanticel Research
US Patent
LigandPNGBDBM283218(4-[2-(4-amino-piperidin-1-yl)-5- (6-methoxy-pyridi...)
Affinity DataIC50: <100nM. Assay description: This assay determines the ability of a test compound to inhibit LSD-1 demethylase activity. E. coli expressed full-length human LSD-1 (Accession numb...
Ligand InfoPC cidPC sid
In DepthDetails US Patent
TargetLysine-specific histone demethylase 1A(Homo sapiens (Human))
Celgene Quanticel Research
US Patent
LigandPNGBDBM283218(4-[2-(4-amino-piperidin-1-yl)-5- (6-methoxy-pyridi...)
Affinity DataIC50: <100nM. Assay description: This assay determines the ability of a test compound to inhibit LSD-1 demethylase activity. E. coli expressed full-length human LSD-1 (Accession numb...
Ligand InfoPC cidPC sid
In DepthDetails US Patent
TargetLysine-specific histone demethylase 1A(Homo sapiens (Human))
Celgene Quanticel Research
US Patent
LigandPNGBDBM283218(4-[2-(4-amino-piperidin-1-yl)-5- (6-methoxy-pyridi...)
Affinity DataIC50: <100nM. Assay description: This assay determines the ability of a test compound to inhibit LSD-1 demethylase activity. E. coli expressed full-length human LSD-1 (Accession numb...
Ligand InfoPC cidPC sid
In DepthDetails US Patent
TargetLysine-specific histone demethylase 1A(Homo sapiens (Human))
Celgene Quanticel Research
US Patent
LigandPNGBDBM283218(4-[2-(4-amino-piperidin-1-yl)-5- (6-methoxy-pyridi...)
Affinity DataIC50: <100nM. Assay description: The enzymatic assay of LSD-1 activity is based on Tnne Resolved-Fluorescence Resonance Energy Transfer (TR-FRET) detection. The inhibitory properties...
Ligand InfoPC cidPC sid
In DepthDetails US Patent
TargetLysine-specific histone demethylase 1A(Homo sapiens (Human))
Celgene Quanticel Research
US Patent
LigandPNGBDBM283218(4-[2-(4-amino-piperidin-1-yl)-5- (6-methoxy-pyridi...)
Affinity DataIC50: <100nM. Assay description: This assay determines the ability of a test compound to inhibit LSD1 demethylase activity. E. coli expressed full-length human LSD1 (Accession number...
Ligand InfoPC cidPC sid
In DepthDetails US Patent