BDBM284988 N-methyl-N-[3-(2-methyl-1-oxoiso- quinolin-4-yl)phenyl]methanesulfonamide::US10023592, Example 33
SMILES CN(c1cccc(c1)-c1cn(C)c(=O)c2ccccc12)S(C)(=O)=O
InChI Key InChIKey=DZHSWGPRDXQLDH-UHFFFAOYSA-N
Data  2 IC50
  Tab Delimited (TSV)   2D SDfile   Computed 3D by Vconf -m prep SDfile
Find this compound or compounds like it in BindingDB:
Activity Spreadsheet -- Enzyme Inhibition Constant Data from BindingDB
Found 2 hits for monomerid = 284988
TargetBromodomain-containing protein 4(Homo sapiens (Human))
Celgene Quanticel Research
Curated by ChEMBL
LigandPNGBDBM284988(N-methyl-N-[3-(2-methyl-1-oxoiso- quinolin-4-yl)ph...)
Affinity DataIC50:  460nM. Assay description: Inhibition of His-tagged human BRD4-BD1 using H4K5acK8acK12acK16ac as substrate preincubated for 30 mins followed by substrate addition measured afte...
Ligand InfoPC cidPC sid
In DepthDetails ArticlePubMed
TargetBromodomain-containing protein 4(Homo sapiens (Human))
Celgene Quanticel Research
Curated by ChEMBL
LigandPNGBDBM284988(N-methyl-N-[3-(2-methyl-1-oxoiso- quinolin-4-yl)ph...)
Affinity DataIC50: <500nMpH: 7.3Assay Description:Determination of the IC50 for the heterocyclic derivative BRD4 inhibitors disclosed herein was performed as follows. His-tagged BRD4 was cloned, expr...
Ligand InfoPC cidPC sid
In DepthDetails US Patent