BDBM285002 N-[3-(6-fluoro-2-methyl-1-oxoisoquinolin-4-yl) phenyl]methanesulfonamide::US10023592, Example 47
SMILES Cn1cc(-c2cccc(NS(C)(=O)=O)c2)c2cc(F)ccc2c1=O
InChI Key InChIKey=BOBNHFRUYGXDMJ-UHFFFAOYSA-N
Data  1 IC50
  Tab Delimited (TSV)   2D SDfile   Computed 3D by Vconf -m prep SDfile
Find this compound or compounds like it in BindingDB:
Activity Spreadsheet -- Enzyme Inhibition Constant Data from BindingDB
Found 1 hit for monomerid = 285002
TargetBromodomain-containing protein 4(Homo sapiens (Human))
Celgene Quanticel Research
US Patent
LigandPNGBDBM285002(N-[3-(6-fluoro-2-methyl-1-oxoisoquinolin-4-yl) phe...)
Affinity DataIC50: <500nMpH: 7.3Assay Description:Determination of the IC50 for the heterocyclic derivative BRD4 inhibitors disclosed herein was performed as follows. His-tagged BRD4 was cloned, expr...
Ligand InfoPC cidPC sid
In DepthDetails US Patent