BDBM285402 5-(2-ethoxy-5-ethylsulfonylphenyl)-1- (2H3)methyl-4-methylpyridin-2-one::US10023592, Example 456::US10023592, Example 458::US10941160, Example 456
SMILES CCOc1ccc(cc1-c1cn(C)c(=O)cc1C)S(=O)(=O)CC
InChI Key InChIKey=GQDKFEKWEKWYFA-UHFFFAOYSA-N
Data  3 IC50
  Tab Delimited (TSV)   2D SDfile   Computed 3D by Vconf -m prep SDfile
Find this compound or compounds like it in BindingDB:
Activity Spreadsheet -- Enzyme Inhibition Constant Data from BindingDB
Found 3 hits for monomerid = 285402
TargetBromodomain-containing protein 4(Homo sapiens (Human))
Celgene Quanticel Research
US Patent
LigandPNGBDBM285402(5-(2-ethoxy-5-ethylsulfonylphenyl)-1- (2H3)methyl-...)
Affinity DataIC50: <500nMpH: 7.3Assay Description:Determination of the IC50 for the heterocyclic derivative BRD4 inhibitors disclosed herein was performed as follows. His-tagged BRD4 was cloned, expr...
Ligand InfoPC cidPC sid
In DepthDetails US Patent
TargetBromodomain-containing protein 4(Homo sapiens (Human))
Celgene Quanticel Research
US Patent
LigandPNGBDBM285402(5-(2-ethoxy-5-ethylsulfonylphenyl)-1- (2H3)methyl-...)
Affinity DataIC50: <500nM. Assay description: Determination of the IC50 for the heterocyclic derivative BRD4 inhibitors disclosed herein was performed as follows. His-tagged BRD4 was cloned, expr...
Ligand InfoPC cidPC sid
In DepthDetails US Patent
TargetBromodomain-containing protein 4(Homo sapiens (Human))
Celgene Quanticel Research
US Patent
LigandPNGBDBM285402(5-(2-ethoxy-5-ethylsulfonylphenyl)-1- (2H3)methyl-...)
Affinity DataIC50: <500nMpH: 7.3Assay Description:Determination of the IC50 for the heterocyclic derivative BRD4 inhibitors disclosed herein was performed as follows. His-tagged BRD4 was cloned, expr...
Ligand InfoPC cidPC sid
In DepthDetails US Patent