BDBM285502 US10077247, Example 20-2
SMILES COCCNC(=O)c1cc2c(OCC[C@]22C[C@H]2C(=O)Nc2cc(ccc2CCCC(O)=O)C#N)cc1F
InChI Key InChIKey=IIHXHXMKLLDTHR-DCFHFQCYSA-N
Data  1 IC50
  Tab Delimited (TSV)   2D SDfile   Computed 3D by Vconf -m prep SDfile
Find this compound or compounds like it in BindingDB:
Activity Spreadsheet -- Enzyme Inhibition Constant Data from BindingDB
Found 1 hit for monomerid = 285502
TargetProstaglandin E2 receptor EP4 subtype(Homo sapiens (Human))
Ono Pharmaceutical
US Patent
LigandPNGBDBM285502(US10077247, Example 20-2)
Affinity DataIC50:  1.60nMT: 2°C. Assay description: EP4 Antagonistic Activity Measurement Experiment Using Prostanoid Receptor Subtype Expressing CellsCHO cells expressing rat EP4 receptor subtypes wer...
Ligand InfoPC cidPC sid
In DepthDetails US Patent