BDBM289524 Ethyl 4-((2S,4R)-1-((5-methoxy-7-methyl-1H-indol-4-yl)methyl)-4-methylpiperidin-2-yl)benzoate::US10093663, Example 41
SMILES CCOC(=O)c1ccc(cc1)[C@@H]1C[C@H](C)CCN1Cc1c(OC)cc(C)c2[nH]ccc12
InChI Key
Data  1 IC50
  Tab Delimited (TSV)   2D SDfile   Computed 3D by Vconf -m prep SDfile
Find this compound or compounds like it in BindingDB:
Activity Spreadsheet -- Enzyme Inhibition Constant Data from BindingDB
Found 1 hit for monomerid = 289524
TargetComplement factor B(Homo sapiens (Human))
Novartis
US Patent
LigandPNGBDBM289524(Ethyl 4-((2S,4R)-1-((5-methoxy-7-methyl-1H-indol-4...)
Affinity DataIC50:  165nMpH: 7.4 T: 2°C. Assay description: CVF-Bb complex prepared from purified cobra venom factor (1 μM), recombinant human complement factor B (expressed in drosophila cells and purifi...
Ligand InfoPC cidPC sid
In DepthDetails US Patent