BDBM291413 1-(6-((6-amino-5-(4-phenoxyphenyl)pyrimidin-4-yl)amino)-2-azaspiro[3.3]heptan-2-yl)prop-2-en-1-one ::US10413562, Compound A124::US9580449, Example A124
SMILES Nc1ncnc(NC2CC3(C2)CN(C3)C(=O)C=C)c1-c1ccc(Oc2ccccc2)cc1
InChI Key InChIKey=JJRJVMQHWURUDF-UHFFFAOYSA-N
Data  1 KI  4 IC50
  Tab Delimited (TSV)   2D SDfile   Computed 3D by Vconf -m prep SDfile
Find this compound or compounds like it in BindingDB:
Activity Spreadsheet -- Enzyme Inhibition Constant Data from BindingDB
Found 5 hits for monomerid = 291413
TargetPotassium voltage-gated channel subfamily H member 2(Homo sapiens (Human))
Merck
Curated by ChEMBL
LigandPNGBDBM291413(1-(6-((6-amino-5-(4-phenoxyphenyl)pyrimidin-4-yl)a...)
Affinity DataKi:  780nM. Assay description: Inhibition of human ERG expressed in HEK293 cells at -80 mV holding potential by HPLC analysis
Ligand InfoPC cidPC sid
In DepthDetails ArticlePubMed
TargetTyrosine-protein kinase BTK(Homo sapiens (Human))
Merck Patent
US Patent
LigandPNGBDBM291413(1-(6-((6-amino-5-(4-phenoxyphenyl)pyrimidin-4-yl)a...)
Affinity DataIC50: <100nM. Assay description: 2.5× stocks of full-length human BTK (08-080) from CarnaBio USA, Inc., Natick, Mass., 1.6×ATP and appropriate kinKDR peptide substrate (FITC-AHA-EEPL...
Ligand InfoPC cidPC sid
In DepthDetails US Patent
TargetTyrosine-protein kinase BTK(Homo sapiens (Human))
Merck Patent
US Patent
LigandPNGBDBM291413(1-(6-((6-amino-5-(4-phenoxyphenyl)pyrimidin-4-yl)a...)
Affinity DataIC50:  2.10nM. Assay description: Covalent inhibition of N-terminal GST-fused human BTK (2-659(end) amino acids) expressed in baculovirus expression system using FITC-AHA-EEPLYWSFPAKK...
Ligand InfoPC cidPC sid
In DepthDetails ArticlePubMed
TargetTyrosine-protein kinase BTK(Homo sapiens (Human))
Merck Patent
US Patent
LigandPNGBDBM291413(1-(6-((6-amino-5-(4-phenoxyphenyl)pyrimidin-4-yl)a...)
Affinity DataIC50: <100nMpH: 7.5 T: 2°C. Assay description: The following describes a microfluidic, off-chip mobility shift kinase assay used to measure inherent potency of compounds against BTK enzyme. Compou...
Ligand InfoPC cidPC sid
In DepthDetails US Patent
TargetTyrosine-protein kinase BTK(Homo sapiens (Human))
Merck Patent
US Patent
LigandPNGBDBM291413(1-(6-((6-amino-5-(4-phenoxyphenyl)pyrimidin-4-yl)a...)
Affinity DataIC50:  66nM. Assay description: Inhibition of BTK in human PBMC cells assessed as reduction in anti-IgM-stimulated CD69 expression on B cells preincubated for 60 mins followed by go...
Ligand InfoPC cidPC sid
In DepthDetails ArticlePubMed